Test run: - Start at Thu Oct 1 04:35:57 UTC 2026 - Docker image: "monitor-test-runner:scli-manual-manual" - Container name: "test-run-07f0138f-2ab7-4d00-b91c-3ad11e369d2d" - Runner git commit: 3d31de04c823a30705ff3eab5a5f3c3f420ec99c 2026-09-25T10:35:24+02:00 Building slices-monitor-test-runner @ file:///app Built slices-monitor-test-runner @ file:///app Uninstalled 1 package in 1ms Installed 1 package in 2ms Run Test: slices-bi-health-check 2026-10-01 04:36:01.829485 UTC - Check DNS 2026-10-01 04:36:01.829622 UTC - Checking system DNS for API host f4fwrapper.slices-be.eu 2026-10-01 04:36:01.830438 UTC - Resolved to 193.191.148.201 2026-10-01 04:36:01.830509 UTC - Checking direct DNS for API host f4fwrapper.slices-be.eu using DNS server 8.8.8.8 2026-10-01 04:36:01.854563 UTC - Resolved to 193.191.148.201 2026-10-01 04:36:01.854637 UTC - Checking direct DNS for API host f4fwrapper.slices-be.eu using DNS server 1.1.1.1 2026-10-01 04:36:01.858388 UTC - Resolved to 193.191.148.201 2026-10-01 04:36:01.858509 UTC - Check Basic Connectivity 2026-10-01 04:36:01.858554 UTC - Checking basic connectivity to BI API of infra be-gent1-bi-baremetal1 at https://f4fwrapper.slices-be.eu 2026-10-01 04:36:01.858573 UTC - Connecting to: https://f4fwrapper.slices-be.eu 2026-10-01 04:36:04.916428 UTC - HTTP connection works. HTTP response code: 502 2026-10-01 04:36:04.916738 UTC - Check List Flavors 2026-10-01 04:36:08.118140 UTC - Error in test step 'List Flavors': ServiceException (for GET https://f4fwrapper.slices-be.eu/apis/bi.slices-ri.eu/v2alpha1/flavors/): 502 Bad Gateway

502 Bad Gateway


nginx
ERROR:slices_monitor_test_runner.main:Test Failed with exception Traceback (most recent call last): File "/app/.venv/lib/python3.14/site-packages/slices_clientlib_core/util/pagination.py", line 90, in __init__ response.raise_for_status() ~~~~~~~~~~~~~~~~~~~~~~~~~^^ File "/app/.venv/lib/python3.14/site-packages/httpx/_models.py", line 829, in raise_for_status raise HTTPStatusError(message, request=request, response=self) httpx.HTTPStatusError: Server error '502 Bad Gateway' for url 'https://f4fwrapper.slices-be.eu/apis/bi.slices-ri.eu/v2alpha1/flavors/' For more information check: https://developer.mozilla.org/en-US/docs/Web/HTTP/Status/502 The above exception was the direct cause of the following exception: Traceback (most recent call last): File "/app/src/slices_monitor_test_runner/test_runners/test_runner_base.py", line 175, in step yield File "/app/src/slices_monitor_test_runner/test_runners/slices_bi_health_check.py", line 97, in run self._check_flavors() ~~~~~~~~~~~~~~~~~~~^^ File "/app/src/slices_monitor_test_runner/test_runners/slices_bi_health_check.py", line 52, in _check_flavors flavors = list(self._bi_client().flavor.list()) ~~~~~~~~~~~~~~~~~~~~~~~~~~~~~^^ File "/app/.venv/lib/python3.14/site-packages/slices_clientlib_bi/bi_flavor.py", line 208, in list return PagedCollection("flavor", AnyFlavor, f"{self._api_base_path}", self._client) # pyright: ignore [reportArgumentType] File "/app/.venv/lib/python3.14/site-packages/slices_clientlib_core/util/pagination.py", line 93, in __init__ raise from_httpx_exception(err) from err slices_clientlib_core.base.exceptions.ServiceException: ServiceException (for GET https://f4fwrapper.slices-be.eu/apis/bi.slices-ri.eu/v2alpha1/flavors/): 502 Bad Gateway

502 Bad Gateway


nginx
The above exception was the direct cause of the following exception: Traceback (most recent call last): File "/app/src/slices_monitor_test_runner/main.py", line 86, in run_test return test_runner.run() ~~~~~~~~~~~~~~~^^ File "/app/src/slices_monitor_test_runner/test_runners/slices_bi_health_check.py", line 93, in run with self.step( ~~~~~~~~~^ "List Flavors", ^^^^^^^^^^^^^^^ description="Requesting flavors using Slices BI API", ^^^^^^^^^^^^^^^^^^^^^^^^^^^^^^^^^^^^^^^^^^^^^^^^^^^^^ ): ^ File "/usr/local/lib/python3.14/contextlib.py", line 162, in __exit__ self.gen.throw(value) ~~~~~~~~~~~~~~^^^^^^^ File "/app/src/slices_monitor_test_runner/test_runners/test_runner_base.py", line 219, in step raise SlicesTestFailure(f"Step {name!r} {retry_suffix2} failed") from e slices_monitor_test_runner.exceptions.SlicesTestFailure: Step 'List Flavors' failed